{"text_format":"1","workbook":"xlsx","n_sheets":12,"sheets":["Copyright","Introducción","Instrucciones de uso","Material relacionado","Datos iniciales","Ingresos","Aportes","Retenciones","F220","Comentarios","Instructivo","Hoja1"],"not_rendered":{"charts":0,"images":11,"macros":1,"external_links":0,"defined_names":1,"comments":0,"pivot_tables":0},"unopened":[],"bounds":{"document_bytes":16777216,"sheet_cells":100000,"rows_first":2000,"rows_last":500,"rows_between":2000,"halvings":0,"cell_chars":16384,"cell_head_chars":4096},"cells_cut":0,"cells_raw":0,"read":"whole","date_system":"1900"}

{"sheet":"Copyright","index":0,"n_rows":15,"n_cols":2,"rows_kept":15,"cut":false,"hidden":true,"merged":[[14,1,14,9],[9,2,9,6],[10,1,10,7],[11,1,11,7],[1,4,1,7],[3,1,3,7],[4,1,4,7],[5,1,5,7],[6,1,6,7],[7,1,7,7]]}
[]
[]
[]
[]
[]
[]
[]
[]
[]
[]
[]
[]
[]
[]
[null,"https://actualicese.com/liquidador-certificado-de-ingresos-y-retenciones-plantilla-del-formulario-220-ag-2022/"]
{"$rows_left_out":1}
{"sheet":"Introducción","index":1,"n_rows":35,"n_cols":8,"rows_kept":35,"cut":false,"hidden":true,"merged":[[10,0,10,7],[12,0,12,7],[5,0,7,7],[9,0,9,7],[18,0,18,7],[14,0,14,7],[16,0,16,5],[16,6,16,7],[17,0,17,4],[17,5,17,7],[13,0,13,7],[8,0,8,7],[20,0,20,7],[21,0,21,7],[24,0,24,2],[24,3,24,7],[25,0,25,7],[26,0,26,7],[27,0,29,7],[32,0,32,6],[31,0,31,7],[34,0,35,7]]}
[]
[]
[]
[]
[]
["[Liquidador] Certificado de ingresos y retenciones: plantilla del formulario 220 AG 2022"]
[]
[]
["Fecha de elaboración: 28 de marzo de 2023"]
["Mediante el artículo 1 de la Resolución 000042 de marzo 15 de 2023 la Dian prescribió el formulario"]
["220 que todos los empleadores (personas naturales y jurídicas) deberán expedir para certificar los pagos por rentas de trabajo del año gravable 2022."]
[]
["Los agentes de retención en la fuente tienen la obligación de expedir anualmente a los asalariados, un certificado de ingresos y retenciones correspondiente al año gravable inmediatamente anterior.\n\n"]
["Al respecto, los artículos 378 y 379 del ET, y el artículo 1.6.1.13.2.40 del DUT 1625 de 2016 (luego de ser modificado por el Decreto 2487 de diciembre 16 de 2022) indican que todos los empleadores deberán expedir el formulario 220 “certificado de ingresos y retenciones” por los pagos laborales que hicieron a sus trabajadores durante el año gravable 2022 antes del 31 de marzo de 2023. \n\nEsta obligación debe cumplirse incluso con aquellos trabajadores que laboraron durante el 2022, aunque se hayan ido de la empresa antes de diciembre 31 de ese mismo año. "]
["Expedición del certificado de ingresos y retenciones por el año gravable 2022"]
{"$rows_left_out":21}
{"sheet":"Instrucciones de uso","index":2,"n_rows":19,"n_cols":1,"rows_kept":19,"cut":false,"hidden":false,"merged":[[5,0,7,7],[15,0,15,7],[17,0,17,7],[18,0,18,7],[16,0,16,7],[10,0,10,7],[11,0,11,7],[12,0,12,7],[13,0,13,7],[8,0,8,7]]}
[]
[]
[]
[]
[]
["Instrucciones de uso"]
[]
[]
[{"$f":"Introducción!A9","v":"Fecha de elaboración: 28 de marzo de 2023"}]
[]
["En el presente formato formulado en Excel se reproduce el contenido del formulario 220 del año gravable 2022."]
["Para su diligenciamiento es importante consultar las hojas “Datos iniciales\", \"Ingresos”, \"Aportes\" y “Retenciones” de este archivo de Excel, en las en las cuales se ingresará la información de los trabajadores. Este formato incluye la posibilidad de ingresar los datos de diferentes personas que perciban rentas de trabajo y de pensiones. "]
["Luego de diligenciar estas hojas se deben revisar la hoja “F220”, que reproduce el formulario 220."]
["Todos los comentarios para el diligenciamiento de estas hojas se encuentran en la hoja “Comentarios” y se podrá acceder a ellos desde los hipervínculos alojados al interior de cada anexo del formato (\"Ir a Nota xxx\"). "]
[]
{"$rows_left_out":5}
{"sheet":"Material relacionado","index":3,"n_rows":30,"n_cols":1,"rows_kept":30,"cut":false,"hidden":false,"merged":[[28,0,28,7],[29,0,29,7],[25,0,25,7],[26,0,26,7],[23,0,23,7],[22,0,22,7],[5,0,7,7],[10,0,10,7],[11,0,11,7],[13,0,13,7],[14,0,14,7],[16,0,16,7],[17,0,17,7],[19,0,19,7],[20,0,20,7],[8,0,8,7]]}
[]
[]
[]
[]
[]
["Material relacionado"]
[]
[]
[{"$f":"Introducción!A9","v":"Fecha de elaboración: 28 de marzo de 2023"}]
[]
["[2023] Formularios e instructivos de la Dian - Actualícese"]
["El Ministerio de Hacienda y la Dian, a través de diversas normas, prescribirán los formatos y formularios para que los contribuyentes obligados a declarar cumplan con sus respectivas obligaciones tributarias durante 2023.\n\nEn este apartado relacionaremos dichas normas y sus respectivos formularios durante el año en curso."]
[]
["[Calendario] Calendario tributario 2023 "]
["Con el calendario tributario 2023  conocerás los plazos de obligaciones tributarias y de reporte de información en Colombia.\n\nSe elaboró a partir de los Decretos 0219 de 2023 y 2487 de 2022, teniendo en cuenta los cambios introducidos por la Ley 2277 de reforma tributaria 2022."]
{"$rows_left_out":16}
{"sheet":"Datos iniciales","index":4,"n_rows":30,"n_cols":12,"rows_kept":30,"cut":false,"hidden":false,"merged":[[5,0,6,11],[8,8,8,11]]}
[]
[]
[]
[]
[]
["DATOS INICIALES"]
[]
["Renglón",24,25,26,27,28,29,33,34,35,"N/A","N/A"]
["Ir a Nota 1",null,null,null,null,null,null,null,"Ir a Nota 2"]
["ID","Tipo de documento","Número de identificación","Primer apellido","Segundo apellido ","Primer nombre","Otros nombres","Lugar donde se practicó la retención","Cód. Dpto.","Cód. Ciudad/Municipio","Dirección","País"]
[1,13,1044140584,"PrimeroA","SegundoA","NombreA","NombreB","Cali",76,"001","CL 1 4 11",169]
[{"$f":"A11+1","v":2},13,31960555,"PrimeroY","SegundoZ","NombreY","NombreZ","Cali",76,"001","CL 2 3 12",169]
[{"$f":"A12+1","v":3}]
[4]
[5]
{"$rows_left_out":16}
{"sheet":"Ingresos","index":5,"n_rows":33,"n_cols":37,"rows_kept":33,"cut":false,"hidden":false,"merged":[[11,2,11,7],[11,10,11,12],[11,13,11,15],[11,27,11,29],[8,30,9,32],[11,30,11,33],[8,22,9,24],[8,25,10,25],[5,0,6,12],[8,34,9,36],[7,34,7,36],[7,10,7,12],[8,10,9,12],[8,13,9,15],[7,13,7,15],[8,16,9,18],[7,16,7,18],[8,26,10,26],[7,27,7,29],[8,27,9,29],[7,19,7,21],[8,19,9,21],[7,22,7,24],[8,9,10,9],[7,30,7,32],[8,33,9,33],[8,0,9,0],[9,2,9,7],[8,2,8,8],[7,1,10,1],[7,2,7,8],[9,8,10,8]]}
[]
[]
[]
[]
[]
["INGRESOS"]
[]
["Renglón","Número de identificación",36,null,null,null,null,null,null,37,38,null,null,39,null,null,40,null,null,41,null,null,42,null,null,43,44,45,null,null,46,null,null,47,48]
["Concepto",null,"Salarios y emolumentos eclesiásticos",null,null,null,null,null,null,"Pagos realizados con bonos electrónicos o de papel de servicio, cheques, tarjetas, vales, etc.","Honorarios",null,null,"Servicios",null,null,"Comisiones",null,null,"Pagos por prestaciones sociales",null,null,"Viáticos",null,null,"Pagos por gastos de representación","Pagos por compensaciones por el trabajo asociado cooperativo","Otros pagos",null,null,"Cesantías e intereses de cesantías efectivamente pagadas, consignadas o reconocidas en elperíodo",null,null,"Cesantías consignadas al fondo de cesantías","Pensiones de jubilación, vejez o invalidez"]
[null,null,"Salarios",null,null,null,null,null,"Emolumentos eclesiásticos"]
["Detalle",null,"Salario días laborados","Auxilio de incapacidad","Horas extra y recargos","Comisiones","Bonificaciones salariales","Otros pagos que constituyen salario",null,null,"Pagos realizados a una persona natural que presta servicios médicos","Pagos realizados a una persona natural que presta servicios contables","Pagos realizados a una persona natural que presta servicios jurídicos","Mantenimiento de instalaciones","Jardinería","Vigilancia","Contratos de mandato","Ventas","Ejecución de actos","Prima de servicios","Vacaciones","Dotación","Gastos de transporte","Manutención","Alojamiento",null,null,"Auxilios extralegales","Bonificaciones ocasionales y por mera liberalidad","Otros pagos","Cesantías pagadas al trabajador en el período (con régimen posterior a la Ley 50 de 1990)","Intereses a las cesantías, pagadas al trabajador en el período","Cesantías reconocidas en el período para aquellos trabajadores del régimen tradicional (con régimen anterior a la Ley 50 de 1990)","Cesantías abonadas al fondo en el período (con régimen posterior a la Ley 50 de 1990)","Jubilación","Vejez","Invalidez"]
["Ir a Nota 1",null,"Ir a Nota 2",null,null,null,null,null,"Ir a Nota 3",null,"Ir a Nota 4",null,null,"Ir a Nota 5",null,null,null,null,null,null,null,null,null,null,null,null,null,"Ir a Nota 6",null,null,"Ir a Nota 7"]
["ID","Número de identificación","Salario días laborados","Auxilio de incapacidad","Horas extra y recargos","Comisiones","Bonificaciones salariales","Otros pagos que constituyen salario","Emolumentos eclesiásticos","Pagos realizados con bonos electrónicos o de papel de servicio, cheques, tarjetas, vales, etc.","Pagos realizados a una persona natural que presta servicios médicos","Pagos realizados a una persona natural que presta servicios contables","Pagos realizados a una persona natural que presta servicios jurídicos","Mantenimiento de instalaciones","Jardinería","Vigilancia","Contratos de mandato","Ventas","Ejecución de actos","Prima de servicios","Vacaciones","Dotación","Gastos de transporte","Manutención","Alojamiento","Pagos por gastos de representación","Pagos por compensaciones por el trabajo asociado cooperativo","Auxilios extralegales","Bonificaciones ocasionales y por mera liberalidad","Otros pagos","Cesantías pagadas al trabajador en el período (con régimen posterior a la Ley 50 de 1990)","Intereses a las cesantías pagadas al trabajador en el período","Cesantías reconocidas en el período para aquellos trabajadores del régimen tradicional (con régimen anterior a la Ley 50 de 1990)","Cesantías abonadas al fondo en el período (con régimen posterior a la Ley 50 de 1990)","Jubilación","Vejez","Invalidez"]
[{"$f":"'Datos iniciales'!A11","v":1},{"$f":"'Datos iniciales'!C11","v":1044140584},18103000,null,null,4500000,null,null,null,null,null,null,null,null,null,null,null,null,null,null,null,null,null,null,null,null,null,null,null,4500000]
[{"$f":"'Datos iniciales'!A12","v":2},{"$f":"'Datos iniciales'!C12","v":31960555},40000000,null,null,null,null,null,null,null,null,null,null,null,null,null,null,null,null,null,null,null,null,null,null,null,null,null,null,null,3000000,360000]
{"$rows_left_out":19}
{"sheet":"Aportes","index":6,"n_rows":33,"n_cols":12,"rows_kept":33,"cut":false,"hidden":false,"merged":[[5,0,6,11],[8,11,10,11],[8,10,10,10],[9,0,10,0],[7,2,10,2],[7,3,10,3],[7,6,7,8],[8,4,9,4],[8,6,8,8],[7,1,10,1],[9,8,10,8],[7,4,7,5],[8,5,10,5],[9,7,10,7],[8,9,10,9]]}
[]
[]
[]
[]
[]
["APORTES"]
[]
["Renglón","Número de identificación","Excedente de pagos que hacen parte de la base de cotización","Base de cotización",50,null,51,null,null,52,53,54]
["Concepto",null,null,null,"Aportes obligatorios por salud a cargo del trabajador dependiente","Aportes obligatorios por salud a cargo del trabajador independiente","Aportes obligatorios a fondos de pensiones y solidaridad pensional a cargo del trabajador",null,null,"Cotizaciones voluntarias al régimen de ahorro individual con solidaridad –RAIS–","Aportes voluntarios al fondo de pensiones voluntarias","Aportes a cuentas AFC"]
["Detalle",null,null,null,null,null,"Aportes obligatorios al fondo de pensiones a cargo del trabajador dependiente","Aportes obligatorios al fondo de pensiones a cargo del trabajador independiente","Fondo de solidaridad pensional"]
[null,null,null,null,0.04,null,0.04]
["Ir a Nota 1",null,null,null,"Ir a Nota 2","Ir a Nota 3","Ir a Nota 4","Ir a Nota 5","Ir a Nota 6","Ir a Nota 7","Ir a Nota 8","Ir a Nota 9"]
["ID","Número de identificación","Excedente de pagos que hacen parte de la base de cotización","Base de cotización","Aportes obligatorios por salud a cargo del trabajador dependiente","Aportes obligatorios por salud a cargo del trabajador independiente","Aportes obligatorios al fondo de pensiones a cargo del trabajador dependiente","Aportes obligatorios al fondo de pensiones a cargo del trabajador independiente","Fondo de solidaridad pensional","Cotizaciones voluntarias al régimen de ahorro individual con solidaridad –RAIS–","Aportes voluntarios al fondo de pensiones voluntarias","Aportes a cuentas AFC"]
[{"$f":"'Datos iniciales'!A11","v":1},{"$f":"'Datos iniciales'!C11","v":1044140584},{"$f":"IF((Ingresos!W14+Ingresos!Z14+Ingresos!AB14+Ingresos!AC14+Ingresos!AD14)>((Ingresos!C14+Ingresos!D14+Ingresos!E14+Ingresos!F14+Ingresos!G14+Ingresos!H14+Ingresos!X14+Ingresos!Y14+Ingresos!W14+Ingresos!Z14+Ingresos!AB14+Ingresos!AC14+Ingresos!AD14)*40%),(Ingresos!W14+Ingresos!Z14+Ingresos!AB14+Ingresos!AC14+Ingresos!AD14)-((Ingresos!C14+Ingresos!D14+Ingresos!E14+Ingresos!F14+Ingresos!G14+Ingresos!H14+Ingresos!X14+Ingresos!Y14+Ingresos!W14+Ingresos!Z14+Ingresos!AB14+Ingresos!AC14+Ingresos!AD14)*40%),0)","v":0},{"$f":"C14+Ingresos!C14+Ingresos!D14+Ingresos!E14+Ingresos!F14+Ingresos!G14+Ingresos!H14+Ingresos!X14+Ingresos!Y14","v":22603000},{"$f":"D14*$E$11","v":904120},null,{"$f":"D14*$G$11","v":904120}]
[{"$f":"'Datos iniciales'!A12","v":2},{"$f":"'Datos iniciales'!C12","v":31960555},{"$f":"IF((Ingresos!W15+Ingresos!Z15+Ingresos!AB15+Ingresos!AC15+Ingresos!AD15)>((Ingresos!C15+Ingresos!D15+Ingresos!E15+Ingresos!F15+Ingresos!G15+Ingresos!H15+Ingresos!X15+Ingresos!Y15+Ingresos!W15+Ingresos!Z15+Ingresos!AB15+Ingresos!AC15+Ingresos!AD15)*40%),(Ingresos!W15+Ingresos!Z15+Ingresos!AB15+Ingresos!AC15+Ingresos!AD15)-((Ingresos!C15+Ingresos!D15+Ingresos!E15+Ingresos!F15+Ingresos!G15+Ingresos!H15+Ingresos!X15+Ingresos!Y15+Ingresos!W15+Ingresos!Z15+Ingresos!AB15+Ingresos!AC15+Ingresos!AD15)*40%),0)","v":0},{"$f":"C15+Ingresos!C15+Ingresos!D15+Ingresos!E15+Ingresos!F15+Ingresos!G15+Ingresos!H15+Ingresos!X15+Ingresos!Y15","v":40000000},{"$f":"D15*$E$11","v":1600000},null,{"$f":"D15*$G$11","v":1600000},null,null,null,null,1000000]
{"$rows_left_out":19}
{"sheet":"Retenciones","index":7,"n_rows":30,"n_cols":4,"rows_kept":30,"cut":false,"hidden":false,"merged":[[7,2,7,3],[5,0,6,3]]}
[]
[]
[]
[]
[]
["RETENCIONES"]
[]
["Renglón",null,55]
["Ir a Nota 1",null,"Ir a Nota 2","Ir a Nota 3"]
["ID","Número de identificación","Retención por rentas de trabajo","Retención por rentas de pensiones"]
[{"$f":"'Datos iniciales'!A11","v":1},{"$f":"'Datos iniciales'!C11","v":1044140584}]
[{"$f":"'Datos iniciales'!A12","v":2},{"$f":"'Datos iniciales'!C12","v":31960555},338000]
[{"$f":"'Datos iniciales'!A13","v":3},{"$f":"'Datos iniciales'!C13","v":0}]
[{"$f":"'Datos iniciales'!A14","v":4},{"$f":"'Datos iniciales'!C14","v":0}]
[{"$f":"'Datos iniciales'!A15","v":5},{"$f":"'Datos iniciales'!C15","v":0}]
{"$rows_left_out":16}
{"sheet":"F220","index":8,"n_rows":68,"n_cols":58,"rows_kept":68,"cut":false,"hidden":false,"merged":[[1,53,1,54],[14,48,14,51],[13,48,13,51],[13,45,13,47],[13,29,13,44],[13,1,13,19],[5,29,5,51],[4,1,5,27],[7,42,7,51],[9,37,9,42],[9,48,9,51],[7,17,7,24],[7,25,7,35],[7,36,7,41],[10,2,10,51],[6,2,6,14],[6,17,6,24],[6,1,10,1],[11,19,11,27],[11,28,11,36],[11,37,11,42],[11,43,11,51],[11,2,11,6],[12,2,12,6],[1,11,3,41],[4,45,4,46],[4,43,4,44],[14,26,14,27],[13,20,13,28],[14,21,14,23],[14,24,14,25],[15,1,15,41],[14,12,14,14],[14,15,14,16],[14,17,14,18],[14,1,14,2],[14,10,14,11],[14,3,14,5],[14,6,14,7],[14,8,14,9],[11,1,12,1],[11,7,11,18],[12,7,12,18],[14,29,14,44],[14,45,14,47],[21,43,21,51],[22,1,22,41],[22,43,22,51],[23,43,23,51],[15,42,15,51],[16,1,16,41],[17,43,17,51],[16,43,16,51],[18,1,18,41],[18,43,18,51],[19,43,19,51],[20,1,20,41],[20,43,20,51],[17,1,17,41],[19,1,19,41],[21,1,21,41],[23,1,23,41],[28,43,28,51],[30,1,30,41],[30,42,30,51],[31,1,31,41],[31,43,31,51],[24,43,24,51],[25,43,25,51],[26,1,26,41],[26,43,26,51],[24,1,24,41],[25,1,25,41],[28,1,28,41],[29,1,29,41],[29,43,29,51],[27,1,27,41],[27,43,27,51],[45,1,45,35],[39,42,39,51],[39,36,39,41],[38,1,38,51],[39,1,39,35],[36,1,36,41],[36,43,36,51],[32,1,32,38],[32,43,32,51],[33,1,33,41],[33,43,33,51],[34,43,34,51],[34,1,34,41],[35,43,35,51],[35,1,35,41],[37,1,37,51],[48,43,48,51],[48,2,48,42],[47,1,47,41],[40,43,40,51],[41,43,41,51],[42,43,42,51],[43,43,43,51],[44,43,44,51],[45,43,45,51],[46,43,46,51],[47,43,47,51],[46,1,46,35],[40,37,40,41],[41,37,41,41],[42,37,42,41],[43,37,43,41],[44,37,44,41],[45,37,45,41],[46,37,46,41],[41,1,41,35],[40,1,40,35],[42,1,42,35],[43,1,43,35],[44,1,44,35],[52,2,52,42],[52,43,52,51],[53,2,53,42],[53,43,53,51],[54,2,54,42],[54,43,54,51],[49,2,49,42],[49,43,49,51],[50,2,50,42],[50,43,50,51],[51,2,51,42],[51,43,51,51],[57,45,57,51],[58,45,58,51],[55,43,55,51],[55,1,55,41],[56,1,56,51],[57,1,57,7],[58,1,58,7],[57,8,57,16],[58,8,58,16],[57,17,57,44],[58,17,58,44],[67,1,67,51],[59,39,66,51],[59,1,59,38],[60,1,60,38],[61,1,61,38],[62,1,62,38],[63,1,63,38],[64,1,64,38],[65,1,65,38],[66,1,66,38],[2,53,2,54],[14,53,14,54],[26,53,26,54],[30,53,30,54],[33,53,33,54],[39,53,39,54],[48,53,48,54],[67,53,67,54],[4,57,4,60]]}
[]
[null,null,null,null,null,null,null,null,null,null,null,"Certificado de Ingresos y Retenciones por Rentas de Trabajo y de Pensiones Año gravable 2022",null,null,null,null,null,null,null,null,null,null,null,null,null,null,null,null,null,null,null,null,null,null,null,null,null,null,null,null,null,null,null,null,null,null,null,null,null,null,null,null,null,"Ir a Nota 1"]
[]
[]
[null,"Antes de diligenciar este formulario lea cuidadosamente las instrucciones",null,null,null,null,null,null,null,null,null,null,null,null,null,null,null,null,null,null,null,null,null,null,null,null,null,null,"4. Número de Formulario",null,null,null,null,null,null,null,null,null,null,null,null,null,null,null,null,null,null,null,null,null,null,null,null,null,"ID",1,null,"Ir a Nota 2"]
[null,null,null,null,null,null,null,null,null,null,null,null,null,null,null,null,null,null,null,null,null,null,null,null,null,null,null,null,null,{"$f":"BD5","v":1}]
[null,"Retenedor","5. Numero de Identificacion Tributaria (NIT)",null,null,null,null,null,null,null,null,null,null,null,null,"6.","DV.","7. Primer Apellido",null,null,null,null,null,null,null,"8. Segundo Apellido",null,null,null,null,null,null,null,null,null,null,"9. Primer Nombre",null,null,null,null,null,"10. Otros Nombres",null,null,null,null,null,null,null,null,null,null,null,2,2]
[]
[]
[null,null,"11.  Razón Social"]
[null,null,null,null,null,null,null,1,6]
[null,"Trabajador","24. Tipo de documento",null,null,null,null,"25. Número de Identificación",null,null,null,null,null,null,null,null,null,null,null,{"$f":"VLOOKUP(AD6,'Datos iniciales'!$A$11:$J$508,4,FALSE)","v":"PrimeroA"},null,null,null,null,null,null,null,null,{"$f":"VLOOKUP(AD6,'Datos iniciales'!$A$11:$J$508,5,FALSE)","v":"SegundoA"},null,null,null,null,null,null,null,null,{"$f":"VLOOKUP(AD6,'Datos iniciales'!$A$11:$J$508,6,FALSE)","v":"NombreA"},null,null,null,null,null,{"$f":"VLOOKUP(AD6,'Datos iniciales'!$A$11:$J$508,7,FALSE)","v":"NombreB"}]
[null,null,{"$f":"VLOOKUP(AD6,'Datos iniciales'!$A$11:$J$508,2,FALSE)","v":13},null,null,null,null,{"$f":"VLOOKUP(AD6,'Datos iniciales'!$A$11:$J$508,3,FALSE)","v":1044140584},null,null,null,null,null,null,null,null,null,null,null,"26. Primer apellido",null,null,null,null,null,null,null,null,"27. Segundo apellido",null,null,null,null,null,null,null,null,"28. Primer nombre",null,null,null,null,null,"29. Otros nombres"]
[null,"Período de la Certificación",null,null,null,null,null,null,null,null,null,null,null,null,null,null,null,null,null,null,"32. Fecha de expedición",null,null,null,null,null,null,null,null,"33. Lugar donde se practicó la retención",null,null,null,null,null,null,null,null,null,null,null,null,null,null,null,"34. Cód. Dpto.",null,null,"35. Cód. Ciudad/Municipio"]
[null,"30. DE:",null,2022,null,null,1,null,1,null,"31. A:",null,2022,null,null,12,null,31,null,null,null,"AAAA",null,null,"MM",null,"DD",null,null,{"$f":"VLOOKUP(AD6,'Datos iniciales'!$A$11:$J$508,8,FALSE)","v":"Cali"},null,null,null,null,null,null,null,null,null,null,null,null,null,null,null,{"$f":"VLOOKUP(AD6,'Datos iniciales'!$A$11:$J$508,9,FALSE)","v":76},null,null,{"$f":"VLOOKUP(AD6,'Datos iniciales'!$A$11:$J$508,10,FALSE)","v":"001"},null,null,null,null,"Ir a Nota 3"]
{"$rows_left_out":54}
{"sheet":"Comentarios","index":9,"n_rows":127,"n_cols":1,"rows_kept":127,"cut":false,"hidden":false,"merged":[[80,0,80,7],[81,0,83,7],[85,0,85,7],[86,0,89,7],[50,0,50,7],[52,0,52,7],[53,0,53,7],[55,0,55,7],[73,0,78,7],[56,0,56,7],[58,0,58,7],[59,0,59,7],[61,0,61,7],[62,0,62,7],[67,0,67,7],[65,0,65,7],[72,0,72,7],[68,0,70,7],[64,0,64,7],[23,0,23,7],[25,0,25,7],[26,0,26,7],[28,0,28,7],[29,0,29,7],[31,0,31,7],[49,0,49,7],[32,0,32,7],[34,0,34,7],[35,0,35,7],[37,0,37,7],[38,0,38,7],[40,0,40,7],[22,0,22,7],[10,0,10,7],[11,0,11,7],[13,0,13,7],[14,0,14,7],[5,0,7,7],[16,0,16,7],[17,0,17,7],[19,0,19,7],[20,0,20,7],[8,0,8,7],[41,0,41,7],[43,0,43,7],[44,0,44,7],[46,0,46,7],[47,0,47,7],[91,0,91,7],[92,0,94,7],[96,0,96,7],[97,0,100,7],[102,0,102,7],[121,0,123,7],[125,0,125,7],[126,0,128,7],[103,0,105,7],[107,0,107,7],[115,0,115,7],[116,0,118,7],[120,0,120,7],[108,0,113,7]]}
[]
[]
[]
[]
[]
["Comentarios y notas para el diligenciamiento de este formato"]
[]
[]
[{"$f":"Introducción!A9","v":"Fecha de elaboración: 28 de marzo de 2023"}]
[]
["Nota 1 (volver a la hoja \"Datos iniciales\")"]
["Esta columna \"ID\" incluida en las hojas \"Datos iniciales\", \"Ingresos\", \"Aportes\" y \"Retenciones\" requiere una numeración consecutiva que será insumo para la emisión de cada archivo en PDF con el borrador del formulario 220. Ver hoja \"F220\", celda BC5."]
[]
["Nota 2 (volver a la hoja \"Datos iniciales\")"]
["Se recomienda dejar los datos sin caracteres especiales y en la nomenclatura empleada en el ejemplo expuesto. "]
{"$rows_left_out":113}
{"sheet":"Instructivo","index":10,"n_rows":0,"n_cols":0,"rows_kept":0,"cut":false,"hidden":false,"merged":[]}

{"sheet":"Hoja1","index":11,"n_rows":0,"n_cols":0,"rows_kept":0,"cut":false,"hidden":false,"merged":[]}